{"text_format":"1","workbook":"xlsx","n_sheets":20,"sheets":["操作説明","【入力】ユーザー入力シート","【出力】結果出力シート（概要）","【出力】結果出力シート（詳細）","【出力・現況】GHG排出量算定シート","【出力・比較対象1】GHG排出量算定シート","【出力・比較対象2】GHG排出量算定シート","プロセスと比較対象","電力CO2排出量原単位","温対法排出原単位","一次処理電力使用量","一次処理活動量","し尿処理施設推定式","年間処理量の推定値","し尿処理施設一覧","トラックバキューム車","焼却のCH4とN2O","化学肥料","マクロ用","選択肢"],"not_rendered":{"charts":2,"images":3,"macros":1,"external_links":0,"defined_names":15,"comments":0,"pivot_tables":0},"unopened":[],"bounds":{"document_bytes":16777216,"sheet_cells":100000,"rows_first":2000,"rows_last":500,"rows_between":2000,"halvings":0,"cell_chars":16384,"cell_head_chars":4096},"cells_cut":0,"cells_raw":0,"read":"whole","date_system":"1900"}

{"sheet":"操作説明","index":0,"n_rows":37,"n_cols":11,"rows_kept":37,"cut":false,"hidden":false,"merged":[[12,6,12,9],[34,2,34,10],[36,2,36,10],[20,1,20,10],[25,3,25,10],[26,3,26,10],[1,0,1,11],[10,1,10,4],[32,2,32,10],[7,1,7,8],[8,1,8,10],[19,1,19,8],[5,1,5,10],[16,6,16,9],[17,6,17,9],[13,6,13,9],[14,6,14,9],[15,6,15,9],[3,0,3,10],[9,0,9,10],[10,6,10,9],[11,6,11,9]]}
[]
["農業集落排水汚泥の資源化に係る温室効果ガス排出削減量の算定プログラム ver.1.0"]
[]
["簡易操作説明"]
[]
[null,"　本プログラムは、「農業集落排水汚泥資源の活用」の検討の参考とするため、汚泥資源の活用方法別の温室効果ガス排出量において、焼却と比較して、肥料化や建設資材としての再利用により、どの程度脱炭素化が図れるのかを計算するものです。"]
[]
[null,"◆算定プログラムの構成"]
{"$rows_left_out":30}
{"sheet":"【入力】ユーザー入力シート","index":1,"n_rows":45,"n_cols":9,"rows_kept":45,"cut":false,"hidden":false,"merged":[[1,5,3,5],[5,2,5,8],[32,6,32,7],[22,3,29,3],[39,2,39,8],[11,3,12,3],[13,3,14,3],[9,3,10,3],[33,3,35,3]]}
[null,null,"ユーザー入力シート 　ver.1.0"]
[null,null,null,null,null,"入力凡例　","「必須」入力・選択項目"]
[null,null,null,null,null,null,"任意入力・選択項目"]
[null,null,null,null,null,null,"入力・選択は不可（自動更新）"]
[]
[null,null,"　基本情報の入力"]
[]
[null,null,null,"農業集落排水処理地区名を入力してください。【手入力】"]
{"$rows_left_out":38}
{"sheet":"【出力】結果出力シート（概要）","index":2,"n_rows":24,"n_cols":15,"rows_kept":24,"cut":false,"hidden":false,"merged":[[1,0,1,8],[4,2,4,5],[4,7,9,7],[5,2,5,5],[6,2,6,5],[13,14,15,14],[16,12,16,13],[17,12,17,13],[18,12,18,13],[17,2,17,3],[18,2,18,3],[16,2,16,3]]}
["結果出力シート　ver.1.0"]
["農業用集落排水施設処理方法別の温室効果ガス排出量の比較（概要）"]
[]
[null,"◆地区の概要"]
[null,"地区名",{"$f":"【入力】ユーザー入力シート!G8","v":0},null,null,null,null,"写真や図面等の貼付欄"]
[null,"施設名",{"$f":"【入力】ユーザー入力シート!G9","v":0}]
[null,"所在地",{"$f":"【入力】ユーザー入力シート!G10&【入力】ユーザー入力シート!G11","v":""}]
[null,"処理人口","計画",{"$f":"【入力】ユーザー入力シート!G12","v":0},"実績",{"$f":"【入力】ユーザー入力シート!G13","v":0}]
{"$rows_left_out":17}
{"sheet":"【出力】結果出力シート（詳細）","index":3,"n_rows":41,"n_cols":10,"rows_kept":41,"cut":false,"hidden":false,"merged":[[1,0,1,10],[12,1,13,3],[15,1,15,3],[16,1,16,3],[4,3,4,5],[5,3,5,5],[6,3,6,5],[32,2,32,3],[26,2,26,3],[31,2,31,3],[27,2,27,3],[17,1,17,3],[18,1,18,3],[19,1,19,3],[20,1,20,3],[21,1,21,3],[22,1,22,3],[23,1,23,3],[24,1,24,3],[25,1,25,3],[30,1,30,3],[28,1,28,3],[29,1,29,3]]}
["結果出力シート　ver.1.0"]
["農業用集落排水施設処理方法別の温室効果ガス排出量の比較（詳細）"]
[]
[null,null,"◆地区の概要"]
[null,null,"地区名",{"$f":"【入力】ユーザー入力シート!G8","v":0}]
[null,null,"施設名",{"$f":"【入力】ユーザー入力シート!G9","v":0}]
[null,null,"所在地",{"$f":"【入力】ユーザー入力シート!G10&【入力】ユーザー入力シート!G11","v":""}]
[]
{"$rows_left_out":34}
{"sheet":"【出力・現況】GHG排出量算定シート","index":4,"n_rows":99,"n_cols":40,"rows_kept":99,"cut":false,"hidden":false,"merged":[[52,0,53,0],[52,3,53,3],[52,4,53,4],[58,0,59,0],[58,3,59,3],[58,4,59,4],[55,4,56,4],[61,0,62,0],[61,3,62,3],[61,4,62,4],[55,0,56,0],[55,3,56,3],[97,3,98,4],[78,0,88,0],[65,0,72,0],[91,0,98,0],[87,3,88,4],[91,3,92,3],[91,4,92,4],[94,3,95,3],[94,4,95,4],[71,3,72,4],[78,3,79,3],[78,4,79,4],[65,3,66,3],[65,4,66,4],[81,3,85,3],[81,4,85,4],[37,0,38,0],[37,3,38,3],[37,4,38,4],[49,0,50,0],[49,3,50,3],[49,4,50,4],[46,0,47,0],[46,3,47,3],[46,4,47,4],[40,3,41,3],[40,4,41,4],[43,0,44,0],[43,3,44,3],[43,4,44,4],[23,10,23,25],[23,26,23,32],[23,33,23,40],[23,2,23,9],[8,3,21,3],[3,3,3,4],[68,3,69,3],[68,4,69,4],[5,0,21,0],[8,4,21,4],[25,0,32,0],[25,3,26,3],[25,4,26,4],[28,3,29,3],[28,4,29,4],[31,3,32,3],[31,4,32,4],[34,0,35,0],[34,3,35,3],[34,4,35,4],[40,0,41,0]]}
[]
[null,null,null,"温室効果ガス排出量算定シート（現況の処理形態）"]
[null,null,null,null,null,null,"合計（現況の最終処理形態）"]
[null,null,null,"プロセス",null,null,{"$f":"IF(G73>0,G73,IF(G89>0,G89,IF(G99>0,G99)))","v":{"$error":"#REF!"}},"t-CO2/年",null,null,null,{"$f":"SUM(L8:O22)/1000","v":{"$error":"#N/A"}},{"$f":"EXACT(ROUND(G4,5),ROUND(L4,5))","v":{"$error":"#REF!"}}]
[null,null,null,null,null,null,null,null,"電気事業者毎の基礎排出係数（R4）"]
["基本情報の入力",null,null,"Q1","地方電力会社",null,{"$f":"【入力】ユーザー入力シート!G17","v":0},null,{"$f":"VLOOKUP(G6,電力CO2排出量原単位!$A$7:$C$16,3,FALSE)","v":{"$error":"#N/A"}},"㎏-CO2/kWh"]
[null,null,null,null,null,null,null,null,null,null,null,"kg-CO2/年"]
[null,null,null,"Q2","最終処理形態",null,{"$f":"【入力】ユーザー入力シート!G20","v":0},null,null,null,null,{"$f":"SUM(O30,AE27,AM27)","v":{"$error":"#N/A"}}]
{"$rows_left_out":92}
{"sheet":"【出力・比較対象1】GHG排出量算定シート","index":5,"n_rows":99,"n_cols":40,"rows_kept":99,"cut":false,"hidden":false,"merged":[[91,0,98,0],[91,3,92,3],[91,4,92,4],[94,3,95,3],[94,4,95,4],[97,3,98,4],[78,0,88,0],[78,3,79,3],[78,4,79,4],[81,3,85,3],[81,4,85,4],[87,3,88,4],[65,0,72,0],[65,3,66,3],[65,4,66,4],[68,3,69,3],[68,4,69,4],[71,3,72,4],[58,0,59,0],[58,3,59,3],[58,4,59,4],[61,0,62,0],[61,3,62,3],[61,4,62,4],[52,0,53,0],[52,3,53,3],[52,4,53,4],[55,0,56,0],[55,3,56,3],[55,4,56,4],[46,0,47,0],[46,3,47,3],[46,4,47,4],[49,0,50,0],[49,3,50,3],[49,4,50,4],[40,0,41,0],[40,3,41,3],[40,4,41,4],[43,0,44,0],[43,3,44,3],[43,4,44,4],[34,0,35,0],[34,3,35,3],[34,4,35,4],[37,0,38,0],[37,3,38,3],[37,4,38,4],[23,26,23,32],[23,33,23,40],[25,0,32,0],[25,3,26,3],[25,4,26,4],[28,3,29,3],[28,4,29,4],[31,3,32,3],[31,4,32,4],[23,10,23,25],[3,3,3,4],[5,0,21,0],[8,3,21,3],[8,4,21,4],[23,2,23,9]]}
[]
[null,null,null,"温室効果ガス排出量算定シート（比較する処理方法①）"]
[null,null,null,null,null,null,"合計（比較する処理方法①）"]
[null,null,null,"プロセス",null,null,{"$f":"IF(G73>0,G73,IF(G89>0,G89,IF(G99>0,G99)))","v":{"$error":"#REF!"}},"t-CO2/年",null,null,null,{"$f":"SUM(L8:O22)/1000","v":{"$error":"#N/A"}},{"$f":"EXACT(ROUND(G4,5),ROUND(L4,5))","v":{"$error":"#REF!"}}]
[null,null,null,null,null,null,null,null,"電気事業者毎の基礎排出係数（R4）"]
["基本情報の入力",null,null,"Q1","地方電力会社",null,{"$f":"【入力】ユーザー入力シート!G17","v":0},null,{"$f":"VLOOKUP(G6,電力CO2排出量原単位!$A$7:$C$16,3,FALSE)","v":{"$error":"#N/A"}},"㎏-CO2/kWh"]
[null,null,null,null,null,null,null,null,null,null,null,"kg-CO2/年"]
[null,null,null,"Q2","最終処理形態",null,{"$f":"IF(【入力】ユーザー入力シート!H21=\"\",【入力】ユーザー入力シート!H20,【入力】ユーザー入力シート!H21)","v":""},null,null,null,null,{"$f":"SUM(O30,AE27,AM27)","v":{"$error":"#N/A"}}]
{"$rows_left_out":92}
{"sheet":"【出力・比較対象2】GHG排出量算定シート","index":6,"n_rows":99,"n_cols":40,"rows_kept":99,"cut":false,"hidden":false,"merged":[[91,0,98,0],[91,3,92,3],[91,4,92,4],[94,3,95,3],[94,4,95,4],[97,3,98,4],[78,0,88,0],[78,3,79,3],[78,4,79,4],[81,3,85,3],[81,4,85,4],[87,3,88,4],[65,0,72,0],[65,3,66,3],[65,4,66,4],[68,3,69,3],[68,4,69,4],[71,3,72,4],[58,0,59,0],[58,3,59,3],[58,4,59,4],[61,0,62,0],[61,3,62,3],[61,4,62,4],[52,0,53,0],[52,3,53,3],[52,4,53,4],[55,0,56,0],[55,3,56,3],[55,4,56,4],[46,0,47,0],[46,3,47,3],[46,4,47,4],[49,0,50,0],[49,3,50,3],[49,4,50,4],[40,0,41,0],[40,3,41,3],[40,4,41,4],[43,0,44,0],[43,3,44,3],[43,4,44,4],[34,0,35,0],[34,3,35,3],[34,4,35,4],[37,0,38,0],[37,3,38,3],[37,4,38,4],[23,26,23,32],[23,33,23,40],[25,0,32,0],[25,3,26,3],[25,4,26,4],[28,3,29,3],[28,4,29,4],[31,3,32,3],[31,4,32,4],[23,10,23,25],[3,3,3,4],[5,0,21,0],[8,3,21,3],[8,4,21,4],[23,2,23,9]]}
[]
[null,null,null,"温室効果ガス排出量算定シート（比較する処理方法②）"]
[null,null,null,null,null,null,"合計（比較する処理方法②）"]
[null,null,null,"プロセス",null,null,{"$f":"IF(G73>0,G73,IF(G89>0,G89,IF(G99>0,G99)))","v":{"$error":"#REF!"}},"t-CO2/年",null,null,null,{"$f":"SUM(L8:O22)/1000","v":{"$error":"#N/A"}},{"$f":"EXACT(ROUND(G4,5),ROUND(L4,5))","v":{"$error":"#REF!"}}]
[null,null,null,null,null,null,null,null,"電気事業者毎の基礎排出係数（R4）"]
["基本情報の入力",null,null,"Q1","地方電力会社",null,{"$f":"【入力】ユーザー入力シート!G17","v":0},null,{"$f":"VLOOKUP(G6,電力CO2排出量原単位!$A$7:$C$16,3,FALSE)","v":{"$error":"#N/A"}},"㎏-CO2/kWh"]
[null,null,null,null,null,null,null,null,null,null,null,"kg-CO2/年"]
[null,null,null,"Q2","最終処理形態",null,{"$f":"IF(【入力】ユーザー入力シート!I21=\"\",【入力】ユーザー入力シート!I20,【入力】ユーザー入力シート!I21)","v":""},null,null,null,null,{"$f":"SUM(O30,AE27,AM27)","v":{"$error":"#N/A"}}]
{"$rows_left_out":92}
{"sheet":"プロセスと比較対象","index":7,"n_rows":40,"n_cols":19,"rows_kept":40,"cut":false,"hidden":true,"merged":[[2,5,3,12],[5,0,19,0],[21,0,35,0],[2,2,3,3]]}
[]
[null,null,null,null,null,null,null,null,null,null,null,null,null,null,null,"ユーザーが入力する項目",null,null,"※ユーザーが入力する項目の０は無と同義"]
[null,null,"現在の処理方法",null,null,"比較対象の処理方法",null,null,null,null,null,null,null,null,null,"ユーザーの入力値によって可変"]
[null,null,null,null,null,null,null,null,null,null,null,null,null,null,null,"ユーザーの入力に関わらず固定"]
[]
["現状が農地還元の場合",null,null,"現状",null,"農地還元（脱水汚泥）","農地還元（機械乾燥汚泥）","農地還元（炭化汚泥）","農地還元（コンポスト化汚泥）（農業集落排水施設でコンポスト化）","農地還元（コンポスト化汚泥）（農業集落排水施設以外でコンポスト化）","埋立（直接埋立：焼却なし）","埋立（焼却あり）","建設資材化"]
[null,null,"濃縮後、別施設への運搬",{"$f":"【入力】ユーザー入力シート!G25","v":0},null,{"$f":"IF($D7=0,\"無\",$D7)","v":"無"},{"$f":"IF($D7=0,\"無\",$D7)","v":"無"},"無","無","有",{"$f":"IF($D7=0,\"無\",$D7)","v":"無"},"有","有"]
[null,null,"再度一次処理",{"$f":"【入力】ユーザー入力シート!G26","v":0},null,"無","無","無","無","有",{"$f":"IF($D8=0,\"無\",$D8)","v":"無"},"有","有"]
{"$rows_left_out":33}
{"sheet":"電力CO2排出量原単位","index":8,"n_rows":16,"n_cols":3,"rows_kept":16,"cut":false,"hidden":true,"merged":[]}
["地球温暖化対策の推進に関する法律施行令第三条第一項第一号ハ"]
["■事務事業編の「温室効果ガス総排出量」の算定における電気の排出係数"]
[]
["また、本係数は年度ごとに変化するため、更新する必要がある。（現在は令和4年の数値が引用されるため、上書きすると最新数値で計算可能）"]
["【１】排出係数",null,"（単位：㎏-CO2/kWh）"]
["電気事業者名",null,"令和4年"]
["北海道電力（株）",null,0.53300000000000003]
["東北電力（株）",null,0.47699999999999998]
{"$rows_left_out":9}
{"sheet":"温対法排出原単位","index":9,"n_rows":183,"n_cols":9,"rows_kept":183,"cut":false,"hidden":true,"merged":[[179,0,179,1],[179,4,182,5],[179,7,179,8],[180,0,180,1],[180,7,180,8],[181,0,181,1],[181,7,181,8],[182,0,182,1],[182,2,182,3],[182,7,182,8],[176,0,176,6],[177,0,177,1],[177,2,177,3],[177,4,177,5],[178,0,178,6],[172,0,172,6],[172,7,172,8],[173,0,174,0],[173,4,175,5],[173,7,173,8],[174,7,174,8],[175,0,175,1],[175,2,175,3],[169,0,169,6],[170,0,170,1],[170,4,171,5],[170,7,170,8],[171,0,171,1],[171,7,171,8],[168,0,168,1],[168,2,168,5],[162,0,162,6],[163,0,167,0],[163,4,167,5],[163,7,163,8],[164,7,164,8],[165,7,165,8],[166,7,166,8],[167,7,167,8],[158,0,158,6],[159,0,161,0],[159,4,161,5],[159,6,161,6],[159,7,159,8],[160,7,160,8],[161,7,161,8],[154,0,154,6],[155,0,156,0],[155,4,157,5],[155,6,156,6],[155,7,155,8],[156,7,156,8],[157,0,157,1],[157,7,157,8],[149,7,149,8],[150,0,150,1],[150,7,150,8],[151,0,151,6],[152,0,153,0],[152,4,153,5],[152,6,153,6],[152,7,152,8],[153,7,153,8],[144,7,144,8],[145,7,145,8],[146,7,146,8],[147,7,147,8],[148,7,148,8],[142,0,142,6],[143,0,143,6],[144,0,149,0],[144,4,150,5],[144,6,149,6],[139,0,139,6],[140,0,141,0],[140,4,141,5],[140,6,141,6],[140,7,140,8],[141,7,141,8],[135,0,135,6],[136,0,138,0],[136,4,138,5],[136,6,138,6],[136,7,136,8],[137,7,137,8],[138,7,138,8],[127,7,127,8],[128,7,128,8],[129,7,129,8],[131,0,133,0],[131,4,134,5],[131,6,133,6],[131,7,131,8],[132,7,132,8],[133,7,133,8],[134,0,134,1],[134,7,134,8],[122,7,122,8],[123,7,123,8],[124,7,124,8],[125,7,125,8],[126,7,126,8],[117,0,117,6],[118,7,118,8],[119,7,119,8],[120,7,120,8],[121,7,121,8],[108,0,108,6],[109,0,111,0],[109,6,111,6],[112,0,112,6],[113,0,116,0],[113,6,116,6],[96,0,99,0],[96,6,99,6],[100,0,100,6],[101,0,107,0],[101,6,107,6],[93,0,93,1],[93,2,93,5],[93,7,93,8],[94,0,94,6],[95,0,95,6],[90,0,90,6],[91,0,92,0],[91,4,92,5],[91,7,91,8],[92,7,92,8],[86,0,86,6],[87,0,89,0],[87,4,89,5],[87,6,89,6],[87,7,87,8],[88,7,88,8],[89,7,89,8],[82,0,82,6],[83,0,84,0],[83,4,85,5],[83,6,84,6],[83,7,83,8],[84,7,84,8],[85,0,85,1],[85,7,85,8],[77,0,77,6],[78,4,81,5],[78,7,78,8],[79,7,79,8],[80,7,80,8],[81,7,81,8],[74,0,74,6],[75,0,76,0],[75,4,76,5],[75,6,76,6],[75,7,75,8],[76,7,76,8],[65,0,65,6],[66,0,71,0],[66,4,73,5],[66,6,72,6],[66,7,66,8],[67,7,67,8],[68,7,68,8],[69,7,69,8],[70,7,70,8],[71,7,71,8],[72,7,72,8],[73,0,73,1],[73,7,73,8],[56,7,56,8],[57,7,57,8],[58,7,58,8],[60,0,64,0],[60,4,64,5],[60,6,64,6],[60,7,60,8],[61,7,61,8],[62,7,62,8],[63,7,63,8],[64,7,64,8],[49,0,49,6],[50,4,54,5],[50,7,50,8],[51,7,51,8],[52,7,52,8],[53,7,53,8],[54,7,54,8],[41,0,41,6],[42,4,48,5],[42,7,42,8],[43,7,43,8],[44,7,44,8],[45,7,45,8],[46,7,46,8],[47,7,47,8],[48,7,48,8],[32,0,32,6],[33,0,35,0],[33,6,35,6],[36,0,36,6],[37,0,40,0],[37,6,40,6],[28,0,28,6],[28,7,28,8],[29,0,29,6],[30,0,31,0],[30,6,31,6],[27,7,27,8],[21,0,23,0],[21,4,23,5],[24,0,24,6],[25,0,26,0],[25,4,27,5],[27,0,27,1],[27,2,27,3],[18,0,18,1],[18,4,19,5],[18,7,18,8],[19,0,19,1],[19,7,19,8],[0,0,0,8],[3,0,4,1],[3,2,3,3],[3,4,3,5],[3,6,4,6],[3,7,4,8],[5,0,5,6],[6,0,6,5],[6,6,17,6],[7,0,17,0]]}
[]
[null,"■これから算出する温室効果ガス総排出量については全て以下の値を使用してください。"]
[null,"■これから平成22年度より前の温室効果ガス総排出量を算定する場合においても、以下の値を使用してください。"]
[null,null,"排出係数",null,"政令の発熱量",null,"活動量","参考"]
[null,null,"      数値"," 単位","       数値"," 単位"]
[" 一号  二酸化炭素（CO2）"]
[" イ：燃料の燃焼に伴う排出",null,null,null,null,null," 総排出量算定期間に本来の用途に従って使用された当該燃料の量\n\n\n\n\n"]
[null," 一般炭",2.47E-2,"（ｋｇ－C/MJ）",25.7,"（MJ/ｋｇ）",null,{"$f":"C8*E8*44/12","v":2.3275633333333334},"　(kg-CO2／kg)に相当"]
{"$rows_left_out":176}
{"sheet":"一次処理電力使用量","index":10,"n_rows":12,"n_cols":4,"rows_kept":12,"cut":false,"hidden":true,"merged":[]}
["R4年度業務における地域整備課提供資料"]
[]
[null,"汚水処理方式","電力使用量（kWh/日）","電力使用量（kWh/年/人）"]
[null,"JARUS-Ⅰ型",392.05,{"$f":"C4*365/700","v":204.42607142857142}]
[null,"JARUS-Ⅲ型",337.25,{"$f":"C5*365/700","v":175.85178571428571}]
[null,"JARUS-Ⅺ型",309.68,{"$f":"C6*365/700","v":161.476}]
[null,"JARUS-ⅩⅣ型",274.55,{"$f":"C7*365/700","v":143.15821428571428}]
[null,"生物膜法","-",{"$f":"(D4+D5)/2","v":190.13892857142855}]
{"$rows_left_out":5}
{"sheet":"一次処理活動量","index":11,"n_rows":10,"n_cols":6,"rows_kept":10,"cut":false,"hidden":true,"merged":[]}
["農業集落排水汚泥利用マニュアル"]
[null,null,null,"単位：％"]
[null,"型式","処理方法","濃縮後含水率","1000人規模の施設の場合の汚泥の乾物重量","強熱減量"]
[null,"JARUS-Ⅰ型","生物膜法",98,13.5,0.67500000000000004]
[null,"JARUS-Ⅲ型","生物膜法",98,13.5,0.67500000000000004]
[null,"JARUS-Ⅺ型","浮遊生物法",98.5,21.6,0.76800000000000002]
[null,"JARUS-ⅩⅣ型","浮遊生物法",98.5,21.6,0.76800000000000002]
[null,"生物膜法","生物膜法",98,13.5,0.67500000000000004]
{"$rows_left_out":3}
{"sheet":"し尿処理施設推定式","index":12,"n_rows":12,"n_cols":31,"rows_kept":12,"cut":false,"hidden":true,"merged":[]}
[null,null,null,"汚水処理方式","嫌気","好気","好希釈","好一段","好二段","標脱","湿式酸化","高負荷","膜分離","焼却","下水投入","浄化槽専用","一次処理","その他"]
[null,null,null,"推定式係数","a1","a2","a3","a4","a5","a6","a7","a8","a9","a10","a11","a12","a13","a14",null,null,null,null,"切片","X（年間処理量,kL）","累乗"]
[null,null,"電力使用量の推定式","係数",-447.25200000000001,338.64,-204.697,411.483,303.09100000000001,731.95799999999997,1650.135,692.79,423.42,-86.245000000000005,-487.88900000000001,-174.249,-712.78099999999995,-165.34399999999999,null,null,null,null,1731.7570000000001,null,0.626]
[]
[null,null,null,"汚泥処理方式",null,null,null,null,null,null,null,null,null,null,null,null,null,null,"焼却","脱水","乾燥","焼却"]
[null,null,null,"推定式係数",null,null,null,null,null,null,null,null,null,null,null,null,null,null,"w10","e1","e2","e3","切片","X（年間処理量,kL）","累乗"]
[null,null,"燃料使用によるCO2排出量推定式","係数",null,null,null,null,null,null,null,null,null,null,null,null,null,null,2.3086000000000002,-1.034,0.95240000000000002,0.81320000000000003,1.2505999999999999,null,0.52910000000000001]
[]
{"$rows_left_out":5}
{"sheet":"年間処理量の推定値","index":13,"n_rows":9,"n_cols":7,"rows_kept":9,"cut":false,"hidden":true,"merged":[[1,1,4,6]]}
[]
[null,"農業集落排水施設で脱水や乾燥工程が行われた場合においてもし尿処理施設の推定式を用いるため、何らかの仮定に基づきし尿処理施設の年間処理量を用いる必要がある。ここでは農業集落排水施設の実績処理人口分がし尿処理施設で処理されたと仮定した場合の年間処理量を使用することで年間処理量を算定する。"]
[]
[]
[]
[]
[null,"農業集落排水施設の実績値処理人口","一般的なし尿処理施設のし尿の割合","一般的なし尿処理施設の浄化槽汚泥の割合","し尿発生量原単位（L/人/日）","浄化槽汚泥発生量原単位（L/人/日）","し尿処理施設に来ると仮定した場合の汚泥量の推定値（㎥/年）"]
[null,null,0.33,0.67,2.83,1.7]
{"$rows_left_out":2}
{"sheet":"し尿処理施設一覧","index":14,"n_rows":884,"n_cols":36,"rows_kept":884,"cut":false,"hidden":true,"merged":[[1,5,2,9],[3,8,4,8],[3,10,4,10],[3,11,4,11],[3,12,4,12],[3,13,4,13],[1,21,2,24],[3,14,4,14],[3,15,4,15],[1,10,2,16],[1,17,2,18],[1,30,4,30],[1,31,4,31],[1,34,5,34],[1,28,4,28],[1,29,4,29],[1,32,5,32],[1,33,5,33],[1,0,5,0],[1,1,5,1],[1,2,5,2],[1,3,5,3],[1,4,5,4],[1,27,5,27],[3,5,4,5],[3,6,4,6],[3,16,5,16],[3,17,5,17],[3,18,4,18],[3,25,4,25],[3,26,4,26],[4,22,5,22],[3,19,5,19],[3,20,4,20],[4,24,5,24],[1,19,2,20],[3,21,5,21],[3,23,5,23],[3,7,4,7]]}
["し尿処理施設・汚泥再生処理センター（R4）"]
["都道府県名","地方公共団体コード","施設コード","地方公共団体名","施設名称","年間処理量",null,null,null,null,"資源化物量",null,null,null,null,null,null,"脱水汚泥の直接埋立",null,"脱水汚泥の焼却",null,"処理方式",null,null,null,"メタン発酵の場合",null,"ごみ処理事業実施方式","処理能力","処理能力\n（有機性廃棄物）","資源化能力","計画メタンガス（バイオガス）量","使用開始年度","運転管理体制","施設の改廃"]
[]
[null,null,null,null,null,"し尿","浄化槽汚泥","有機性廃棄物","その他",null,"メタン発酵","堆肥化","リン回収","助燃剤製造","炭化","その他","資源化物量の区分","直接埋立の有無","埋立量","焼却の有無","焼却量","汚水処理",null,"汚泥処理",null,"メタンガス発熱量","メタンガス利用方法"]
[null,null,null,null,null,null,null,null,null,"合計",null,null,null,null,null,null,null,null,null,null,null,null,"その他（具体的）",null,"その他（具体的）"]
[null,null,null,null,null,"(kl/年度)","(kl/年度)","(t/年度)","(kl/年度)","(kl/年度)","(t/年)","(t/年)","(t/年)","(t/年)","(t/年)","(t/年)",null,null,"（t/年度)",null,"（t/年度)",null,null,null,null,"（kJ/㎥N）",null,null,"(kL/日)","(t/日)","(t/日)","(㎥/日)"]
["北海道","01202","0120002","函館市","函館市し尿処理場",43977,4336,null,null,{"$f":"SUM(F7:I7)","v":48313},null,null,null,null,null,null,null,"直接埋立無し",null,"焼却無し",null,"下水投入, その他",null,"その他",null,null,null,"③DB（公設公営、運転委託）",244,0,0,0,1983,"委託",null,"01-1-202-08-001"]
["北海道","01206","0120006","釧路市","大楽毛下水終末処理場　し尿・浄化槽汚泥等受入施設",13780.6,4799,null,null,{"$f":"SUM(F8:I8)","v":18579.599999999999},null,null,null,null,null,null,"資源化物の生産量","直接埋立無し",null,"焼却無し",null,"一次処理",null,"脱水",null,null,null,"④DB+M（公設公営、維持管理のみ委託）",80.400000000000006,0,0,0,2013,"委託",null,"01-1-206-08-002"]
{"$rows_left_out":877}
{"sheet":"トラックバキューム車","index":15,"n_rows":11,"n_cols":11,"rows_kept":11,"cut":false,"hidden":true,"merged":[]}
["出典：サプライチェーンを通じた組織の温室効果ガス排出等の算定のための排出原単位データベースVer 3.3"]
[]
[null,"車種","燃費（km/L）","距離当たりのCO2排出量（㎏-CO2/km）","積載量（㎥）","積載量の根拠","CH４原単位（kg-CH4/㎞)","N2O原単位（kg-N2O/㎞)",null,null,"一般的なバキューム車の情報"]
["ガソリン","ガソリン車バキュームカー",4.96,{"$f":"34.6*0.0183*44/12/C4","v":0.46807661290322583},3.7,"4tバキューム車の最大積載量の値を採用",{"$f":"温対法排出原単位!C49","v":3.4999999999999997E-5},{"$f":"温対法排出原単位!C125","v":3.4999999999999997E-5},null,null,"https://www.shinmaywa.co.jp/toho/products/dl/environment42_01.pdf"]
["軽油","軽油車小型バキュームカー（2-3tトラック）",{"$f":"(6.19+4.58)/2","v":5.3849999999999998},{"$f":"37.7*0.0187*44/12/C5","v":0.48003033116682153},2.5,"最大積載量2－3tの値を採用",{"$f":"温対法排出原単位!C$55","v":1.2999999999999999E-5},{"$f":"温対法排出原単位!C$130","v":2.5000000000000001E-5},null,null,"https://www.morita-econos.com/hygiene/hygiene/index.html"]
["軽油","軽油車中型バキュームカー（4tトラック）",4.58,{"$f":"37.7*0.0187*44/12/C6","v":0.56440247452692882},3.7,"4tバキューム車の最大積載量の値を採用",{"$f":"温対法排出原単位!C$55","v":1.2999999999999999E-5},{"$f":"温対法排出原単位!C$130","v":2.5000000000000001E-5}]
["軽油","軽油車大型バキュームカー（10tトラック以上）",{"$f":"(3.79+3.38+3.09+2.89)/4","v":3.2875000000000001},{"$f":"37.7*0.0187*44/12/C7","v":0.78630063371356163},9,"最大積載6－12tの中央値を採用",{"$f":"温対法排出原単位!C$55","v":1.2999999999999999E-5},{"$f":"温対法排出原単位!C$130","v":2.5000000000000001E-5}]
["ガソリン","ガソリン車トラック",4.96,{"$f":"34.6*0.0183*44/12/C8","v":0.46807661290322583},4,"4t車の最大積載量の値を採用",{"$f":"温対法排出原単位!C46","v":3.4999999999999997E-5},{"$f":"温対法排出原単位!C122","v":3.8999999999999999E-5}]
{"$rows_left_out":4}
{"sheet":"焼却のCH4とN2O","index":16,"n_rows":12,"n_cols":8,"rows_kept":12,"cut":false,"hidden":true,"merged":[]}
[]
["焼却（CH4）"]
[null,"温対法",null,null,"割合"]
[null," （１）連続燃焼式焼却施設",9.5E-4,"（ｋｇ－CH4／ｔ）",{"$f":"354/516","v":0.68604651162790697},{"$f":"E4*C4","v":6.5174418604651164E-4}]
[null," （２）准連続燃焼式焼却施設",7.6999999999999999E-2,"（ｋｇ－CH4／ｔ）",{"$f":"82/516","v":0.15891472868217055},{"$f":"E5*C5","v":1.2236434108527133E-2},null,"加重平均"]
[null," （３）バッチ燃焼式焼却施設",7.5999999999999998E-2,"（ｋｇ－CH4／ｔ）",{"$f":"80/516","v":0.15503875968992248},1.1782945736434108E-2,null,{"$f":"SUM(F4:F6)","v":2.4671124031007751E-2}]
[]
["焼却（N２O）"]
{"$rows_left_out":5}
{"sheet":"化学肥料","index":17,"n_rows":27,"n_cols":19,"rows_kept":27,"cut":false,"hidden":true,"merged":[[0,16,0,17],[0,4,0,7],[0,8,0,11],[0,12,0,15]]}
[null,null,null,null,"窒素",null,null,null,"リン酸",null,null,null,"カリ",null,null,null,"合計"]
[null,null,null,null,"出典：水野・吉羽　汚泥肥料の種類と成分含有量の実態ーFAMICの肥料検査成績からー","中村委員より受領した「環境にやさしい農業を始めよう」（後藤　2019）より引用","出典（計算式）：農業集落排水ハンドブック","農林水産省「農業資材の供給の状況に関する調査結果（R3）」","出典：水野・吉羽　汚泥肥料の種類と成分含有量の実態ーFAMICの肥料検査成績からー","出典：農業集落排水ハンドブック、「環境にやさしい農業を始めよう」（後藤　2019）より引用","出典（計算式）：農業集落排水ハンドブック","農林水産省「農業資材の供給の状況に関する調査結果（R3）」","出典：水野・吉羽　汚泥肥料の種類と成分含有量の実態ーFAMICの肥料検査成績からー","出典：北海道施肥ガイド（道総研　2020）","出典（計算式）：農業集落排水ハンドブック","農林水産省「農業資材の供給の状況に関する調査結果（R3）」",null,null,"出典：汚泥肥料の活用推進プロジェクト取組成果について"]
[null,null,null,null,"https://agriknowledge.affrc.go.jp/RN/2010853145.pdf",null,null,"https://www.maff.go.jp/j/seisan/sien/sizai/s_hiryo/210528.html","https://agriknowledge.affrc.go.jp/RN/2010853145.pdf",null,null,"https://www.maff.go.jp/j/seisan/sien/sizai/s_hiryo/210528.html","https://agriknowledge.affrc.go.jp/RN/2010853145.pdf",null,null,"https://www.maff.go.jp/j/seisan/sien/sizai/s_hiryo/210528.html",null,null,"https://www.maff.go.jp/kanto/kikaku/midori_syokuryou/attach/pdf/setsumeikai_shiryou_5-2-2.pdf"]
[null,null,"含水率","汚泥肥料の種類","全窒素（現物％）","窒素肥効率（＝有機質資材の養分利用率/化学肥料の養分利用率）","汚泥肥料1kgあたりの汚泥肥料の化学肥料養分相当量(N-kg/kg)","汚泥肥料の化学肥料養分相当量（尿素換算）(円/kg）","全リン酸（現物％）","リン酸肥効率（＝有機質資材の養分利用率/化学肥料の養分利用率）","汚泥肥料1kgあたりの汚泥肥料の化学肥料養分相当量(kg)","汚泥肥料の化学肥料養分相当量(円)（過リン酸石灰換算）","カリ（現物％）","カリ肥効率（＝有機質資材の養分利用率/化学肥料の養分利用率）","汚泥肥料1kgあたりの汚泥肥料の化学肥料養分相当量(kg)","汚泥肥料の化学肥料養分相当量(円)（塩化カリウム換算）","汚泥肥料1kgあたりの化学肥料相当量の合計（円/kg）","汚泥肥料1kgあたりの化学肥料相当量のCO2排出量（kg-Co2/kg）","以上に基づき汚泥肥料は水田よりも畑地に施肥する場合が多く、葉菜類、根菜類、果菜類等の幅広い品目で利用されている。"]
[null,"脱水汚泥の農地還元",85,"し尿汚泥肥料",{"$f":"-0.0548*C5+5.5328","v":0.87479999999999958},0.54,{"$f":"1*化学肥料!E5/100*化学肥料!F5","v":4.7239199999999978E-3},{"$f":"G5*1743/20/46*100","v":0.89497745217391267},{"$f":"E5*0.8697+1.1282","v":1.8890135599999998},1,{"$f":"1*化学肥料!I5/100*化学肥料!J5","v":1.8890135599999996E-2},{"$f":"K5*1739/20/17.5*100","v":9.3856988023999985},0.3,1,{"$f":"1*化学肥料!M5/100*化学肥料!N5","v":3.0000000000000001E-3},{"$f":"O5*1952/20/60*100","v":0.48799999999999999},{"$f":"SUM(P5,L5,H5)","v":10.768676254573911},{"$f":"$D$15*Q5","v":0.12101838374890161}]
[null,"機械乾燥汚泥の農地還元",40,"し尿汚泥肥料",{"$f":"-0.0548*C6+5.5328","v":3.3407999999999998},0.54,{"$f":"1*化学肥料!E6/100*化学肥料!F6","v":1.8040320000000002E-2},{"$f":"G6*1743/20/46*100","v":3.4178562782608695},{"$f":"E6*0.8697+1.1282","v":4.0336937600000002},1,{"$f":"1*化学肥料!I6/100*化学肥料!J6","v":4.0336937600000004E-2},{"$f":"K6*1739/20/17.5*100","v":20.04169556754286},0.3,1,{"$f":"1*化学肥料!M6/100*化学肥料!N6","v":3.0000000000000001E-3},{"$f":"O6*1952/20/60*100","v":0.48799999999999999},{"$f":"SUM(P6,L6,H6)","v":23.94755184580373},{"$f":"$D$15*Q6","v":0.26912258764314229}]
[null,"コンポスト化汚泥の農地還元",40,"汚泥発酵肥料",{"$f":"-0.0545*C7+4.4397","v":2.2597},0.41,{"$f":"1*化学肥料!E7/100*化学肥料!F7","v":9.2647699999999986E-3},{"$f":"G7*1743/20/46*100","v":1.7552710989130433},{"$f":"E7*1.1012+0.6859","v":3.1742816400000002},1,{"$f":"1*化学肥料!I7/100*化学肥料!J7","v":3.1742816400000005E-2},{"$f":"K7*1739/20/17.5*100","v":15.771645062742859},0.7,1,{"$f":"1*化学肥料!M7/100*化学肥料!N7","v":6.9999999999999993E-3},{"$f":"O7*1952/20/60*100","v":1.1386666666666665},{"$f":"SUM(P7,L7,H7)","v":18.665582828322567},{"$f":"$D$15*Q7","v":0.209763819824689}]
[]
{"$rows_left_out":20}
{"sheet":"マクロ用","index":18,"n_rows":28,"n_cols":4,"rows_kept":28,"cut":false,"hidden":true,"merged":[]}
[null,null,"神栖市","汚泥再生処理センターエコパーク鉾田"]
[null,null,"水戸市","大洋サニタリーセンター"]
[null,null,"土浦市"]
[null,null,"常陸太田市"]
[null,null,"常陸太田市"]
[null,null,"北茨城市"]
[null,null,"つくば市"]
[null,null,"つくば市"]
{"$rows_left_out":21}
{"sheet":"選択肢","index":19,"n_rows":49,"n_cols":26,"rows_kept":49,"cut":false,"hidden":true,"merged":[]}
[]
[null,"有無",null,null,null,null,"処理プロセス",null,null,"処理する場所",null,"処理する場所",null,"処理する場所",null,"都道府県",null,"脱水又は乾燥が農業集落排水施設で行われなかった場合","入力情報（現況の最終処理形態）","比較対象１","比較対象２",null,"脱水又は乾燥が農業集落排水施設で行われた場合","入力情報（現況の最終処理形態）","比較対象１","比較対象２"]
[null,"有",null,null,null,null,"農地還元（脱水汚泥）",null,null,"農業集落排水施設",null,"農業集落排水施設",null,"し尿処理施設",null,"北海道",null,null,"農地還元（脱水汚泥）","埋立（焼却あり）","建設資材化",null,null,"農地還元（脱水汚泥）","埋立（焼却あり）","建設資材化"]
[null,"無",null,null,null,null,"農地還元（機械乾燥汚泥）",null,null,"し尿処理施設",null,"し尿処理施設",null,"焼却施設",null,"青森県",null,null,"農地還元（機械乾燥汚泥）","埋立（焼却あり）","建設資材化",null,null,"農地還元（機械乾燥汚泥）","埋立（焼却あり）","建設資材化"]
[null,null,null,null,null,null,"農地還元（炭化汚泥）",null,null,"その他",null,"焼却施設",null,"その他",null,"岩手県",null,null,"農地還元（炭化汚泥）","埋立（焼却あり）","建設資材化",null,null,"農地還元（炭化汚泥）","埋立（焼却あり）","建設資材化"]
[null,null,null,null,null,null,"農地還元（コンポスト化汚泥）（農業集落排水施設でコンポスト化）",null,null,null,null,"その他",null,null,null,"宮城県",null,null,"農地還元（コンポスト化汚泥）（農業集落排水施設でコンポスト化）","埋立（焼却あり）","建設資材化",null,null,"農地還元（コンポスト化汚泥）（農業集落排水施設でコンポスト化）","埋立（焼却あり）","建設資材化"]
[null,null,null,null,null,null,"農地還元（コンポスト化汚泥）（農業集落排水施設以外でコンポスト化）",null,null,null,null,null,null,null,null,"秋田県",null,null,"農地還元（コンポスト化汚泥）（農業集落排水施設以外でコンポスト化）","埋立（焼却あり）","建設資材化",null,null,"農地還元（コンポスト化汚泥）（農業集落排水施設以外でコンポスト化）","埋立（焼却あり）","建設資材化"]
[null,null,null,null,null,null,"埋立（焼却あり）",null,null,null,null,null,null,null,null,"山形県",null,null,"埋立（焼却あり）","農地還元（コンポスト化汚泥）（農業集落排水施設以外でコンポスト化）","建設資材化",null,null,"埋立（焼却あり）","農地還元（コンポスト化汚泥）（農業集落排水施設でコンポスト化）","建設資材化"]
{"$rows_left_out":41}